Welcome, Guest.
Username: Password: Remember me

TOPIC: ERROR: 0:19: error(#132) Syntax error: "noperspect

ERROR: 0:19: error(#132) Syntax error: "noperspect 1 year 7 months ago #1

I tried to run the reshade for Breath of the Wild Zelda (Cemu) emulator 1.7.4d

Then the following appears: (taken from log file)

Appreciate if you can help! Thanks in advance

2017-04-23T21:57:18:699 [40980] | ERROR | Failed to compile 'C:\Users\***********\Desktop\cemu_1.7.4d\reshade-shaders\Shaders\FXAA.fx':
Fragment shader failed to compile with the following errors:
ERROR: 0:19: error(#132) Syntax error: "noperspective" parse error
ERROR: error(#273) 1 compilation errors. No code generated

C:\Users\The Monster\Desktop\cemu_1.7.4d\reshade-shaders\Shaders\FXAA.fx(54, 8): error: internal shader compilation failed
Fragment shader(s) were not successfully compiled before glLinkProgram() was called. Link failed.
C:\Users\The Monster\Desktop\cemu_1.7.4d\reshade-shaders\Shaders\FXAA.fx(89, 1): error: program linking failed
Fragment shader failed to compile with the following errors:
ERROR: 0:284: error(#132) Syntax error: "noperspective" parse error
ERROR: error(#273) 1 compilation errors. No code generated

C:\Users\The Monster\Desktop\cemu_1.7.4d\reshade-shaders\Shaders\FXAA.fx(62, 8): error: internal shader compilation failed
Fragment shader(s) were not successfully compiled before glLinkProgram() was called. Link failed.
C:\Users\The Monster\Desktop\cemu_1.7.4d\reshade-shaders\Shaders\FXAA.fx(96, 1): error: program linking failed
The administrator has disabled public write access.